{"text_format":"1","workbook":"xlsx","n_sheets":6,"sheets":["PRODUCCION","Campdet","LINEAS_GRUPOS","GruposNov2023","GRUPOS2022","DATOS"],"not_rendered":{"charts":0,"images":3,"macros":1,"external_links":0,"defined_names":70,"comments":1,"pivot_tables":0},"unopened":[],"bounds":{"document_bytes":16777216,"sheet_cells":100000,"rows_first":2000,"rows_last":500,"rows_between":2000,"halvings":0,"cell_chars":16384,"cell_head_chars":4096},"cells_cut":0,"cells_raw":0,"read":"whole","date_system":"1900"}

{"sheet":"PRODUCCION","index":0,"n_rows":38,"n_cols":6,"rows_kept":38,"cut":false,"hidden":false,"merged":[[18,3,18,6],[7,2,7,6],[29,1,29,2],[25,3,25,4],[26,3,26,4],[27,3,27,4],[28,3,28,4],[29,3,29,4],[24,1,24,2],[25,1,25,2],[26,1,26,2],[27,1,27,2],[28,1,28,2],[8,1,8,6],[17,1,17,3],[18,1,18,2],[35,0,36,6],[9,3,9,4],[16,4,16,6],[17,4,17,6],[13,5,13,6],[10,5,10,6],[11,5,11,6],[12,5,12,6],[34,0,34,6],[31,1,31,6],[32,1,32,3],[25,5,25,6],[32,5,32,6],[26,5,26,6],[27,5,27,6],[33,1,33,6],[3,1,3,6],[4,1,4,6],[5,1,5,6],[6,1,6,6],[30,0,30,6],[14,1,14,3],[15,1,15,3],[29,5,29,6],[14,4,14,6],[9,0,12,0],[10,1,12,2],[24,3,24,4],[14,0,17,0],[16,1,16,3],[13,3,13,4],[0,0,0,6],[37,0,37,6],[22,1,22,6],[2,1,2,6],[23,0,23,6],[9,1,9,2],[24,5,24,6],[1,0,1,6],[28,5,28,6],[9,5,9,6],[15,4,15,6],[10,3,12,4],[18,0,21,0],[19,1,19,6],[20,1,20,6],[21,1,21,6]]}
["FORMULARIO PARA REGISTRO DE PUBLICACIONES CIENTÍFICAS "]
["INFORMACIÓN PRODUCCIÓN CIENTÍFICA, REGIONAL, OBRA DE RELEVANCIA CORRESPONDIENTE A PROPIEDAD INTELECTUAL"]
["Título del artículo indexado:"]
["Nombre de la revista:"]
["ISSN:"]
["URL del artículo publicado / DOI:"]
["URL de revista "]
["Tipo de Estudio"," -- Seleccione una opción --","-- Seleccione una opción --"]
["Semillero de investigación institucional: (opcional)","Colocar nombre de semillero de investigación:"]
["Revista indexada en las bases de datos:\n","BASES DE DATOS DE PRODUCCIÓN CIENTÍFICA",null,"BASES DE DATOS DE PRODUCCIÓN REGIONAL",null,"OTRAS BASES DE DATOS\n(Escriba la Base de Datos)"]
[]
[]
[]
["Fechas","Fecha de Aceptación","dd/mm/aaaa","Fecha de Publicación",null,"dd/mm/aaaa"]
["Líneas  investigación institucionales\nEscoja la/las linea(s) de investigación que sea pertinente a su artículo","LÍNEAS ",null,null,"SUBLÍNEAS "]
[null,"Seleccione una línea de investigación:",null,null,"EMPRENDIMIENTO INNOVACIÓN Y DESARROLLO "]
[null,"Seleccione una línea de investigación:",null,null,"Seleccione una sublínea de investigación:"]
[null,"Seleccione una línea de investigación:",null,null,"Seleccione una sublínea de investigación:"]
["Campo/s detallado/s de conocimiento \nEscoja un/unos campo(s) detallado(s) que sea pertinente a su artículo","CAMPO AMPLIO DEL CONOCIMIENTO",null,"CAMPO DETALLADO"]
[null,"Seleccione un campo detallado"]
[null,"Seleccione un campo detallado"]
[null,"Seleccione un campo detallado"]
["Observaciones adicionales: "]
["AUTORES CON FILIACIÓN UNACH "]
["Datos personales","Autor 1",null,"Autor 2",null,"Autor 3"]
["Cédula o Pasaporte","0000"]
["Nombres"]
["Apellidos"]
["Marcar con una X al autor principal","X"]
["Cargo (Seleccione)","Estudiante de Maestria"]
{"$rows_left_out":9}
{"sheet":"Campdet","index":1,"n_rows":96,"n_cols":5,"rows_kept":96,"cut":false,"hidden":true,"merged":[]}
["Seleccione un campo detallado","Seleccione un campo detallado"]
["ACTIVIDAD FISICA","SERVICIOS"]
["ADMINISTRACION","ADMINISTRACION"]
["ARQUITECTURA, URBANISMO Y RESTAURACION","INGENIERIA, INDUSTRIA Y CONSTRUCCION"]
["ARTES","ARTES Y HUMANIDADES"]
["ASISTENCIA A ADULTOS MAYORES Y DISCAPACITADOS","SALUD Y BIENESTAR"]
["ASISTENCIA A LA INFANCIA Y SERVICIOS PARA JOVENES","SALUD Y BIENESTAR"]
["BIBLIOTELOGIA, DOCUMENTACION Y ARCHIVOLOGIA","CIENCIAS SOCIALES, PERIODISMO, INFORMACION Y DERECHO"]
["BIODIVERSIDAD","CIENCIAS NATURALES, MATEMATICAS Y ESTADISTICA"]
["BIOFARMACEUTICA","CIENCIAS NATURALES, MATEMATICAS Y ESTADISTICA"]
["BIOFISICA","CIENCIAS NATURALES, MATEMATICAS Y ESTADISTICA"]
["BIOLOGIA","CIENCIAS NATURALES, MATEMATICAS Y ESTADISTICA"]
["BIOMEDICINA","CIENCIAS NATURALES, MATEMATICAS Y ESTADISTICA"]
["BIOQUIMICA","CIENCIAS NATURALES, MATEMATICAS Y ESTADISTICA"]
["CIENCIAS DE LA TIERRA","CIENCIAS NATURALES, MATEMATICAS Y ESTADISTICA"]
["CIENCIAS POLITICAS","CIENCIAS SOCIALES, PERIODISMO, INFORMACION Y DERECHO"]
["COMERCIO","ADMINISTRACION"]
["COMPETENCIAS LABORALES","ADMINISTRACION"]
["COMPUTACION","TECNOLOGIAS DE LA INFORMACION Y LA COMUNICACION (TIC)"]
["CONSTRUCCION E INGENIERIA CIVIL","INGENIERIA, INDUSTRIA Y CONSTRUCCION"]
["CONTABILIDAD Y AUDITORIA","ADMINISTRACION"]
["DERECHO","CIENCIAS SOCIALES, PERIODISMO, INFORMACION Y DERECHO"]
["DESARROLLO Y ANALISIS DE SOFTWARE Y APLICACIONES","TECNOLOGIAS DE LA INFORMACION Y LA COMUNICACION (TIC)"]
["DISEÑO","ARTES Y HUMANIDADES"]
["DISEÑO INDUSTRIAL Y DE PROCESOS","INGENIERIA, INDUSTRIA Y CONSTRUCCION"]
["DISEÑO Y ADMINISTRACION DE REDES Y BASES DE DATOS","TECNOLOGIAS DE LA INFORMACION Y LA COMUNICACION (TIC)"]
["DISEÑO Y CONSTRUCCION DE VEHICULOS, BARCOS Y AERONAVES MOTORIZADAS","INGENIERIA, INDUSTRIA Y CONSTRUCCION"]
["ECONOMIA","CIENCIAS SOCIALES, PERIODISMO, INFORMACION Y DERECHO"]
["ECONOMIA MATEMATICA","CIENCIAS SOCIALES, PERIODISMO, INFORMACION Y DERECHO"]
["EDUCACION","EDUCACION"]
{"$rows_left_out":67}
{"sheet":"LINEAS_GRUPOS","index":2,"n_rows":71,"n_cols":13,"rows_kept":71,"cut":false,"hidden":true,"merged":[]}
[null,null,null,"LÍNEAS DE INVESTIGACIÓN CON SUBLÍNEAS",null,null,null,null,null,"ÁREA DEL CONOCIMIENTO","LÍNEAS DE INVESTIGACIÓN",null,"Seleccione un campo detallado"]
["ÁREA DEL CONOCIMIENTO","LÍNEAS DE INVESTIGACIÓN","VALOR","CIENCIAS_SOCIALES_Y_DEL_COMPORTAMIENTO","INGENIERÍA_INFORMÁTICA","LÍNEAS DE INVESTIGACIÓN 2022","sublinea salud","sublinea CIENCIAS SOCIALES Y DEL COMPORTAMIENTO",null,"EDUCACIÓN","CIENCIAS_DE_LA_EDUCACIÓN_Y_FORMACIÓN_PROFESIONAL_/_NO_PROFESIONAL",null,"Educación"]
[null,"Seleccione una línea de investigación:",null,"ECONOMÍA DEL DESARROLLO","MODELADO Y SIMULACIÓN DE SISTEMAS","Seleccione una línea de investigación:","Seleccione una sublínea de investigación:","Seleccione una sublínea de investigación:",null,"CIENCIAS NATURALES, MATEMÁTICAS Y ESTADÍSTICA","CIENCIAS_DE_LA_VIDA",null,"Formación para docentes de educación preprimaria"]
["Educación","CIENCIAS_DE_LA_EDUCACIÓN_Y_FORMACIÓN_PROFESIONAL_O_NO_PROFESIONAL",{"$f":"MATCH(LINEA1,LINEAS_GRUPOS!$B$4:$B$20,0)","v":{"$error":"#N/A"}},"EMPRENDIMIENTO INNOVACIÓN Y DESARROLLO EMPRESARIAL",null,"CIENCIAS_DE_LA_VIDA","ATENCIÓN INTEGRAL DE SALUD INDIVIDUAL FAMILIAR COMUNITARIA E INTERCULTURAL","EMPRENDIMIENTO INNOVACIÓN Y DESARROLLO ",null,"CIENCIAS SOCIALES, PERIODISMO, INFORMACIÓN Y DERECHO","CIENCIAS_SOCIALES_Y_DEL_COMPORTAMIENTO",null,"Formación para docentes sin asignaturas de especialización"]
["Ciencias naturales, matemáticas y estadística","CIENCIAS_DE_LA_VIDA",{"$f":"MATCH(LINEA2,LINEAS_GRUPOS!$B$4:$B$20,0)","v":{"$error":"#N/A"}},"POLITICA ECONOMICA",null,"CIENCIAS_SOCIALES_Y_DEL_COMPORTAMIENTO.","SALUD PÚBLICA",null,null,"CIENCIAS SOCIALES, PERIODISMO, INFORMACIÓN Y DERECHO","COMUNICACIÓN_Y_CULTURA",null,"Formación para docentes con asignaturas de especialización"]
["Ciencias sociales, periodismo, información y derecho","CIENCIAS_SOCIALES_Y_DEL_COMPORTAMIENTO_",{"$f":"MATCH(LINEA3,LINEAS_GRUPOS!$B$4:$B$20,0)","v":{"$error":"#N/A"}},null,null,"COMUNICACION ","SERVICIOS SOCIALES",null,null,"ARTES Y HUMANIDADES","CULTURA_VISUAL",null,"Psicopedagogía"]
["Ciencias sociales, periodismo, información y derecho","COMUNICACIÓN_Y_CULTURA",{"$f":"MATCH(LINEA4,LINEAS_GRUPOS!$B$4:$B$20,0)","v":{"$error":"#REF!"}},null,null,"CULTURA_VISUAL",null,null,null,"CIENCIAS SOCIALES, PERIODISMO, INFORMACIÓN Y DERECHO","DERECHOS_Y_GARANTIAS_CONSTITUCIONALES",null,"Diseño"]
["Artes y humanidades","CULTURA_VISUAL",null,null,null,"DERECHOS_Y_GARANTIAS_CONSTITUCIONALES",null,null,null,"INGENIERÍA, INDUSTRIA Y CONSTRUCCIÓN","ELECTRÓNICA,_TELECOMUNICACIONES_Y_REDES",null,"Artes"]
["Ciencias sociales, periodismo, información y derecho","DERECHOS_Y_GARANTIAS_CONSTITUCIONALES",null,null,null,"CIENCIAS_DE_LA_EDUCACIÓN_Y_FORMACIÓN_PROFESIONAL_O_NO_PROFESIONAL",null,null,null,"CIENCIAS SOCIALES, PERIODISMO, INFORMACIÓN Y DERECHO","GESTIÓN_SOCIOECONÓMICA,_CONTABLE,_TRIBUTARIA_Y_LABORAL",null,"Historia y Arqueología"]
["Ingeniería, industria y construcción","ELECTRÓNICA_TELECOMUNICACIONES_Y_REDES",null,"INGENIERÍA_CONSTRUCCIÓN_INDUSTRIA_Y_PRODUCCIÓN","MEDIOAMBIENTE_Y_BIODIVERSIDAD","GESTIÓN_SOCIOECONÓMICA_CONTABLE_TRIBUTARIA_Y_LABORAL","sublinea INGENIERÍA INFORMÁTICA","sublinea INGENIERÍA, CONSTRUCCIÓN, INDUSTRIA Y PRODUCCIÓN",null,"INGENIERÍA, INDUSTRIA Y CONSTRUCCIÓN","INGENIERÍA_CONSTRUCCIÓN_INDUSTRIA_Y_PRODUCCIÓN",null,"Idiomas"]
["Ciencias sociales, periodismo, información y derecho","GESTIÓN_SOCIOECONÓMICA_CONTABLE_TRIBUTARIA_Y_LABORAL",null,"ARQUITECTURA Y CONSTRUCCIÓN","CALIDAD DEL SUELO","INGENIERIA_INFORMATICA","Seleccione una sublínea de investigación:","Seleccione una sublínea de investigación:",null,"TECNOLOGÍA DE LA INFORMACIÓN Y LA COMUNICACIÓN (TIC)","INGENIERÍA_INFORMÁTICA",null,"Literatura y lingüística"]
["Ingeniería, industria y construcción","INGENIERÍA_CONSTRUCCIÓN_INDUSTRIA_Y_PRODUCCIÓN",null,"PRODUCTIVIDAD Y PROYECTOS DE INFRAESTRUCTURA",null,"INGENIERIA_CONSTRUCCION_INDUSTRIA_Y_PRODUCCION","CIENCIA DE LOS DATOS Y SISTEMAS INTELIGENTES","SISTEMAS DE GESTIÓN Y PRODUCCIÓN INDUSTRIAL",null,"CIENCIAS NATURALES, MATEMÁTICAS Y ESTADÍSTICA","MEDIOAMBIENTE_Y_BIODIVERSIDAD",null,"Economía"]
["Tecnología de la información y la comunicación (tic)","INGENIERÍA_INFORMÁTICA",null,null,null,"AMBIENTE_Y_BIODIVERSIDAD","CIBERSEGUIRAD E INFRAESTRUCTURA TI",null,null,"PATRIMONIO Y SABERES ANCESTRALES","PATRIMONIO_Y_SABERES_ANCESTRALES",null,"Economía matemática"]
["Ciencias naturales, matemáticas y estadística","MEDIOAMBIENTE_Y_BIODIVERSIDAD",null,null,null,"SALUD_",null,null,null,"SALUD Y BIENESTAR","SALUD",null,"Ciencias Políticas"]
["Patrimonio y saberes ancestrales","PATRIMONIO_Y_SABERES_ANCESTRALES",null,null,null,"SERVICIOS_PERSONALES",null,null,null,"SERVICIOS","SERVICIOS_PERSONALES",null,"Psicología"]
["Salud y bienestar","SALUD.",null,"SALUD.",null,"SISTEMAS_DE_PRODUCCIÓN_Y_DESARROLLO_AGROINDUSTRIAL",null,null,null,"SALUD Y BIENESTAR","SERVICIOS_SOCIALES",null,"Estudios Sociales y Culturales"]
["Servicios","SERVICIOS_PERSONALES",null,"ATENCIÓN INTEGRAL DE SALUD INDIVIDUAL FAMILIAR COMUNITARIA E INTERCULTURAL",null,"TICS_EN_LA_EDUCACIÓN","sublinea AMBIENTE Y BIODIVERSIDAD","COMUNICACION ",null,"INGENIERÍA, INDUSTRIA Y CONSTRUCCIÓN","SISTEMAS_DE_PRODUCCIÓN_Y_DESARROLLO_AGROINDUSTRIAL",null,"Geografía y Territorio"]
["Salud y bienestar","SERVICIOS_SOCIALES",null,"SALUD PÚBLICA",null,"ELECTRÓNICA_TELECOMUNICACIONES_Y_REDES","Seleccione una sublínea de investigación:","No hay sublíneas",null,"TECNOLOGÍA DE LA INFORMACIÓN Y LA COMUNICACIÓN (TIC)","TICS_EN_LA_EDUCACIÓN",null,"Periodismo y Comunicación"]
["Ingeniería, industria y construcción","SISTEMAS_DE_PRODUCCIÓN_Y_DESARROLLO_AGROINDUSTRIAL",null,null,null,"ARQUITECTURA_Y_CONSTRUCCION","CALIDAD DE SUELO","ARQUITECTURA_Y_CONSTRUCCION",null,null,null,null,"Derecho"]
["Tecnología de la información y la comunicación (tic)","TICS_EN_LA_EDUCACIÓN",null,"CIENCIAS_DE_LA_EDUCACIÓN_Y_FORMACIÓN_PROFESIONAL_O_NO_PROFESIONAL","CULTURA_VISUAL","ECONOMIA_DEL_DESARROLLO_Y_POLITICA_ECONOMICA","CALIDAD Y CANTIDAD DE AGUA","No hay sublíneas",null,null,null,null,"Contabilidad y auditoría"]
[null,null,null,"No hay sublíneas","No hay sublíneas","ESTUDIOS_CULTURALES_COLONIALES_Y_POSCOLONIALES",null,"ESTUDIOS_CULTURALES_COLONIALES_Y_POSCOLONIALES",null,null,null,null,"Gestión Financiera"]
[null,null,null,"CIENCIAS_DE_LA_VIDA","DERECHOS_Y_GARANTIAS_CONSTITUCIONALES","PATRIMONIO_Y_SABERES_ANCESTRALES",null,"No hay sublíneas",null,null,null,null,"Administración"]
[null,"GRUPOS DE INVESTIGACIÓN",null,"No hay sublíneas","No hay sublíneas",null,null,"ECONOMIA_DEL_DESARROLLO_Y_POLITICA_ECONOMICA",null,null,null,null,"Mercadotecnia y publicidad"]
[null,"Seleccione un grupo de investigación:",null,"COMUNICACIÓN_Y_CULTURA","ELECTRÓNICA_TELECOMUNICACIONES_Y_REDES",null,null,"No hay sublíneas",null,null,null,null,"Información gerencial"]
[null,"Actividad física, salud y deporte",null,"No hay sublíneas","No hay sublíneas",null,null,null,null,null,null,null,"Comercio"]
[null,"Análisis contable, tributario y de auditoría para el desarrollo económico y social",null,"GESTIÓN_SOCIOECONÓMICA_CONTABLE_TRIBUTARIA_Y_LABORAL","SERVICIOS_SOCIALES",null,null,null,null,null,null,null,"Competencias Laborales"]
[null,"Análisis de muestras biológicas y forenses",null,"No hay sublíneas","No hay sublíneas",null,null,null,null,null,null,null,"Biología"]
[null,"Ciudades sostenibles intermedias",null,"PATRIMONIO_Y_SABERES_ANCESTRALES","SISTEMAS_DE_PRODUCCIÓN_Y_DESARROLLO_AGROINDUSTRIAL",null,null,null,null,null,null,null,"Biofísica"]
[null,"Estudios Interdiciplinarios",null,"No hay sublíneas","No hay sublíneas",null,null,null,null,null,null,null,"Bioquímica"]
[null,"Cuidados en procesos vitales",null,"SERVICIOS_PERSONALES","TICS_EN_LA_EDUCACIÓN",null,null,null,null,null,null,null,"Genética"]
{"$rows_left_out":42}
{"sheet":"GruposNov2023","index":3,"n_rows":40,"n_cols":1,"rows_kept":40,"cut":false,"hidden":true,"merged":[]}
["Seleccione un grupo de investigación:"]
["ACTIVIDAD FÍSICA, SALUD Y DEPORTE"]
["ANÁLISIS CONTABLE, TRIBUTARIO Y DE AUDITORÍA PARA EL DESARROLLO ECONÓMICO Y SOCIAL"]
["ANÁLISIS DE MUESTRAS BIOLÓGICAS Y FORENSES"]
["CIUDADES SOSTENIBLES INTERMEDIAS"]
["COMUNICACIONES, CIBERSEGURIDAD, TELEMÁTICA Y TECNOLOGÍAS INCLUSIVAS - GI(CT)2I"]
["CUIDADOS EN PROCESOS VITALES"]
["CURRÍCULO, PROCESOS, ACTORES Y AMBIENTES EDUCATIVOS"]
["GIGAE  GRUPO INTERDISCIPLINARIO DE GESTION DE LA ADMINISTRACION Y ECONOMÍA"]
["DISEÑO Y CULTURA VISUAL"]
["ECOAPLYD"]
["ESPECDI. EPISTEMOLOGÍA PEDAGÓGICA, CURRICULAR Y DIDÁCTICA"]
["ESTUDIOS ECONÓMICOS Y EMPRESARIALES PARA EL DESARROLLO TERRITORIAL "]
["ESTUDIOS INTERDICIPLINARIOS"]
["ETZA KURI"]
["GARANTÍAS CONSTITUCIONALES Y DERECHOS HUMANOS"]
["GESTIÓN Y DESARROLLO DE TURISMO"]
["GRUPO CIEA"]
["CIENCIAS HISTÓRICAS Y PATRIMONIO CULTURAL"]
["INGENIERÍA   Y CONSTRUCCIÓN SUSTENTABLE"]
["INOCUIDAD Y VALORIZACIÓN DE RECURSOS PARA LA AGROINDUSTRIA"]
["MEDIOS Y ARTES NARRATIVAS E INTERACTIVAS, CONVERGENCIAS Y EMERGENCIAS EN COMUNICACIÓN Y CULTURA DIGITAL Y EDUCATIVA I+D+C+I"]
["MODSIM, INVESTIGACIONES DE MODELAMIENTO Y SIMULACIÓN"]
["NEUROCIENCIAS"]
["NEUROPSICOPEDAGOGÍA"]
["PRODUCCIÓN ANIMAL E INDUSTRIALIZACIÓN"]
["PSICOLOGÍA Y SALUD MENTAL"]
["PURUHÁ, ARQUEOLOGÍA E HISTORIA DE LA NACIONALIDAD PURUHÁ HASTA LA ACTUALIDAD"]
["RAZONAMIENTO CRÍTICO, FILOSOFÍA, HISTORIA Y TEORIA SOCIAL"]
["REHABILITACIÓN Y SALUD EN MOVIMIENTO"]
{"$rows_left_out":11}
{"sheet":"GRUPOS2022","index":4,"n_rows":37,"n_cols":1,"rows_kept":37,"cut":false,"hidden":true,"merged":[]}
["GRUPOS DE INVESTIGACIÓN"]
["Seleccione un grupo de investigación:"]
["Actividad física, salud y deporte"]
["Análisis contable, tributario y de auditoría para el desarrollo económico y social"]
["Análisis de muestras biológicas y forenses"]
["Ciudades sostenibles intermedias"]
["Estudios Interdiciplinarios"]
["Cuidados en procesos vitales"]
["Currículo, procesos, actores y ambientes educativos"]
["Desarrollo local y organizacional (DELO)"]
["Diseño y cultura visual"]
["ECOAPLYD"]
["Estudios económicos y empresariales para el desarrollo territorial "]
["Garantías constitucionales y derechos humanos"]
["Salud oral integral"]
["Gestión y desarrollo de turismo"]
["Grupo CIEA"]
["Investigación vegetal agroindustrial"]
["Medios y artes narrativas e interactivas, convergencias y emergencias en comunicación y cultura digital y educativa I+D+C+i"]
["ModSim, investigaciones de modelamiento y simulación"]
["Neurociencias"]
["Neuropsicopedagogía"]
["Producción animal e industrialización"]
["Psicología y salud mental"]
["Puruhá, arqueología e historia de la nacionalidad Puruhá hasta la actualidad"]
["Comunicaciones, ciberseguridad, telemática y tecnologías inclusivas - GI(CT)2I"]
["Razonamiento crítico, filosofía, historia y teoria social"]
["Salud integral"]
["Salud pública"]
["Telecomunicaciones, informática, industria y construcción (TEIIC)"]
{"$rows_left_out":8}
{"sheet":"DATOS","index":5,"n_rows":40,"n_cols":26,"rows_kept":40,"cut":false,"hidden":true,"merged":[]}
["Enviado",0,null,"Autor 1","Autor 2","Autor 3","Autor 4","Autor 5",null,"OBRAS DE RELEVANCIA",null,null,null,"TÍTULOS",null,null,"ORIGEN DE PROYECTOS",null,null," -- Seleccione una opción --"," -- Seleccione una opción --"," -- Seleccione una opción --",null,null,null," -- Seleccione una opción --"]
["Seleccione una opción:",null,null,5,1,1,1,1,null,"Seleccione una obra:",null,null,null,"Seleccione una opción:",null,null,"Seleccione una opción:",null,null,"Tutor Interno","MAESTRÍA EN RESTAURACIÓN Y CONSERVACIÓN DE BIENES CULTURALES CON MENCIÓN EN PATRIMONIO EDIFICADO","ESPECIALIZACIÓN EN IMAGENOLOGÍA",null,null,null,"Programa"]
["Aceptado",null,null,null,null,null,null,null,null,"Libros",null,null,null,"PhD.",null,null,"INVESTIGACIÓN",null,null,"Tutor Externo","MAESTRÍA EN MATEMÁTICA APLICADA CON MENCIÓN EN MATEMÁTICA COMPUTACIONAL","ESPECIALIZACIÓN EN PEDIATRÍA",null,null,null,"Especialidad"]
["En impresión",null,null,null,null,null,null,null,null,"Capítulos de libros",null,null,null,"Máster",null,null,"VINCULACIÓN",null,null,"Estudiante de Maestria","MAESTRÍA EN SEGURIDAD INDUSTRIAL MENCIÓN PREVENCIÓN DE RIESGOS LABORALES"]
["Publicado",null,null,null,null,null,null,null,null,"Software",null,null,null,"Ingeniero(a)",null,null,"INVESTIGACIÓN / VINCULACIÓN",null,null,null,"MAESTRÍA EN INGENIERÍA AMBIENTAL CON MENCIÓN EN RECURSOS HÍDRICOS"]
[null,null,null,null,null,null,null,null,null,"Producción artística",null,null,null,"Abogado(a)",null,null,"NINGUNA",null,null,null,"MAESTRÍA EN INGENIERÍA CIVIL CON MENCIÓN EN GESTIÓN DE LA CONSTRUCCIÓN"]
[null,null,null,null,null,null,null,null,null,"Patente",null,null,null,"Doctor(a)(No PhD)",null,null,null,null,null,null,"MAESTRÍA EN GESTIÓN DEL TALENTO HUMANO"]
[null,null,null,null,null,null,null,null,null,"Modelo de utilidad",null,null,null,"Licenciado(a)",null,null,null,null,null,null,"MAESTRÍA EN ADMINISTRACIÓN PÚBLICA MENCIÓN DESARROLLO INSTITUCIONAL"]
[null,null,null,null,null,null,null,null,null,"Diseño industrial",null,null,null,"Arquitecto(a)",null,null,null,null,null,null,"MAESTRÍA EN CRIMINALÍSTICA Y CIENCIAS FORENSES"]
[null,null,null,null,null,null,null,null,null,"Esquemas de trazado de circuitos integrados",null,null,null,"Tecnólogo",null,null,null,null,null,null,"MAESTRÍA EN DERECHO PROCESAL Y LITIGACIÓN ORAL"]
[null,null,null,null,null,null,null,null,null,"Creaciones u obtenciones vegetales o animales",null,null,null,"Técnico",null,null,null,null,null,null,"MAESTRÍA EN CONTABILIDAD Y AUDITORÍA"]
[null,null,null,null,null,null,null,null,null,"Contribuciones presentadas en Congresos / Ponencias",null,null,null,"Estudiante",null,null,null,null,null,null,"MAESTRÍA EN CONTABILIDAD Y FINANZAS CON MENCIÓN EN GESTIÓN FISCAL, FINANCIERA Y TRIBUTARIA"]
[null,1,null,"FACULTADES",null,null,null,null,null,null,null,null,null,null,null,null,null,null,null,null,"MAESTRÍA EN ECONOMÍA Y DIRECCIÓN DE EMPRESAS"]
[null,1,null,"Seleccione una Facultad:",null,null,null,null,null,null,null,null,null,null,null,null,null,null,null,null,"MAESTRÍA EN DERECHO, MENCIÓN DERECHO ADMINISTRATIVO"]
["BASE DE DATOS",0,null,"Ciencias_de_la_Educación_Humanas_y_Tecnologías",null,null,null,null,null,null,null,null,null,null,null,null,null,null,null,null,"MAESTRÍA EN DERECHO CONSTITUCIONAL, MENCIÓN DERECHO PROCESAL CONSTITUCIONAL"]
["SCIMAGO",0,null,"Ciencias_Políticas_y_Administrativas",null,null,null,null,null,null,null,null,null,null,null,null,null,null,null,null,"MAESTRÍA EN GERENCIA HOSPITALARIA"]
["ISI WEB",0,null,"Ingeniería",null,null,null,null,null,null,null,null,null,null,null,null,null,null,null,null,"MAESTRÍA EN SALUD PÚBLICA, MENCIÓN ENFERMERÍA FAMILIAR Y COMUNITARIA"]
["SCOPUS",0,null,"Salud",null,null,null,null,null,null,null,null,null,null,null,null,null,null,null,null,"MAESTRÍA EN ODONTOLOGÍA PREVENTIVA Y SOCIAL "]
[null,1,null,null,null,null,null,null,null,null,null,null,null,null,null,null,null,null,null,null,"MAESTRÍA EN PSICOLOGÍA CLÍNICA, MENCIÓN PSICOTERAPIA"]
["Estado de publicacion",1,null,null,null,null,null,null,null,null,null,null,null,null,null,null,null,null,null,null,"MAESTRÍA EN FISIOTERAPIA Y REHABILITACIÓN CON MENCIÓN EN TERAPIA INCLUSIVA E INTEGRAL"]
[null,null,null,null,null,null,null,null,null,null,null,null,null,null,null,null,null,null,null,null,"MAESTRÍA EN PEDAGOGÍA DE LAS CIENCIAS EXPERIMENTALES, MENCIÓN QUÍMICA Y BIOLOGÍA"]
[null,null,null,null,null,null,null,null,null,null,null,null,null,null,null,null,null,null,null,null,"MAESTRÍA EN EDUCACIÓN, MENCIÓN EN GESTIÓN DEL APRENDIZAJE MEDIADO POR TIC"]
[null,null,null,"Ciencias_de_la_Educación_Humanas_y_Tecnologías",null,null,null,null,"Ciencias_Políticas_y_Administrativas",null,null,null,"Ingeniería",null,null,"Salud",null,null,null,null,"MAESTRÍA EN PEDAGOGÍA DE LA HISTORIA Y LAS CIENCIAS SOCIALES"]
[null,null,null,"Diseño Gráfico",null,null,null,null,"Administración de Empresas",null,null,null,"Arquitectura",null,null,"Enfermería",null,null,null,null,"MAESTRÍA EN PSICOPEDAGOGÍA CON MENCIÓN EN ATENCIÓN A LAS NECESIDADES EDUCATIVAS ESPECIALES"]
[null,null,null,"Educación Básica",null,null,null,null,"Comunicación",null,null,null,"Ingeniería Agroindustrial",null,null,"Fisioterapia",null,null,null,null,"MAESTRÍA EN PSICOLOGÍA, MENCIÓN NEUROPSICOLOGÍA DEL APRENDIZAJE"]
[null,null,null,"Educación Inicial",null,null,null,null,"Contabilidad y Auditoría",null,null,null,"Ingeniería Ambiental",null,null,"Laboratorio Clínico",null,null,null,null,"MAESTRÍA EN DERECHO, MENCIÓN DERECHO ADMINISTRATIVO"]
[null,null,null,"Pedagogía de la Actividad Física y el Deporte",null,null,null,null,"Derecho",null,null,null,"Ingeniería Civil",null,null,"Medicina",null,null,null,null,"MAESTRÍA EN AGROINDUSTRIA"]
[null,null,null,"Pedagogía de la Historia y las Ciencias Sociales ",null,null,null,null,"Economía",null,null,null,"Ingeniería en Tecnologías de la Información",null,null,"Odontología",null,null,null,null,"MAESTRÍA EN EDUCACIÓN MENCIÓN INCLUSIÓN EDUCATIVA Y ATENCIÓN A LA DIVERSIDAD"]
[null,null,null,"Pedagogía de la Informática",null,null,null,null,"Turismo",null,null,null,"Ingeniería en Telecomunicaciones",null,null,"Psicología Clínica",null,null,null,null,"MAESTRÍA EN PEDAGOGÍA DE LOS IDIOMAS NACIONALES Y EXTRANJEROS CON MENCIÓN EN INGLÉS"]
[null,null,null,"Pedagogía de la Lengua y la Literatura",null,null,null,null,null,null,null,null,"Ingeniería Industrial",null,null,null,null,null,null,null,"MAESTRÍA EN DIAGNÓSTICO DE LABORATORIO CLÍNICO Y MOLECULAR, CON MENCIÓN EN BIOQUÍMICA CLÍNICA"]
{"$rows_left_out":10}